{"text_format":"1","workbook":"xlsx","n_sheets":2,"sheets":["Datasheet","Input"],"not_rendered":{"charts":1,"images":0,"macros":1,"external_links":0,"defined_names":18,"comments":0,"pivot_tables":0},"unopened":[],"bounds":{"document_bytes":16777216,"sheet_cells":100000,"rows_first":2000,"rows_last":500,"rows_between":2000,"halvings":0,"cell_chars":16384,"cell_head_chars":4096},"cells_cut":0,"cells_raw":0,"read":"whole","date_system":"1900"}

{"sheet":"Datasheet","index":0,"n_rows":26,"n_cols":8,"rows_kept":26,"cut":false,"hidden":false,"merged":[[13,1,13,3],[7,1,7,3],[10,1,10,3],[8,1,8,2],[9,1,9,2]]}
["Maine Beach Profiling Datasheet",null,null,"ver 1.4[xlsm]",null,null,null,"View Instructions"]
[]
["Line Name"]
["Stake Name"]
["Sample Date"]
["Start Time"]
["End Time"]
["Team Names"]
["Field Recorder"]
["Data Entry Name"]
["General Conditions"]
["Horizon Visibility"]
[]
["Comments"]
[]
["Measurements"]
["Point","Vertical","Horizontal","Comments","Y","X"]
[1,null,3,null,{"$f":"B18","v":0},{"$f":"C18","v":3}]
[{"$f":"A18+1","v":2},null,3,null,{"$f":"E18+B19","v":0},{"$f":"F18+C19","v":6}]
[{"$f":"A19+1","v":3},null,3,null,0,9]
[4,null,3,null,0,12]
[{"$f":"A21+1","v":5},null,3,null,0,15]
[6,null,3,null,0,18]
[7,null,3,null,0,21,null,"Compare Datasheet Values to Another Survey:"]
[8,null,3,null,0,24]
[9,null,3,null,0,27]

{"sheet":"Input","index":1,"n_rows":83,"n_cols":32,"rows_kept":83,"cut":false,"hidden":false,"merged":[]}
[]
["SelectedLineID",{"$f":"_xlfn.IFNA(VLOOKUP(Datasheet!B3,Beach_Profile_Lines[],2,TRUE),\"\")","v":""},null,"SelectedStake",{"$f":"Datasheet!B4","v":0},null,null,null,null,null,null,null,null,"SelectedDate",{"$f":"Datasheet!M24","v":0},null,null,"SelectedDate2",{"$f":"Datasheet!M25","v":0},null,null,"SelectedDate3",{"$f":"Datasheet!M26","v":0},null,null,"SelectedDate4",{"$f":"Datasheet!M27","v":0},null,null,"SelectedDate5",{"$f":"Datasheet!M28","v":0}]
[]
["Line_Name","lineid",null,"Line_Name","lineid","Stake_Name","stakeid",null,"Visibility",null,"Stake_Name","Sample_Date",null,"Profile_Point","X_Stake","Y_Stake",null,"Profile_Point","X_Stake","Y_Stake",null,"Profile_Point","X_Stake","Y_Stake",null,"Profile_Point","X_Stake","Y_Stake",null,"Profile_Point","X_Stake","Y_Stake"]
["CE01",83,null,null,null,null,null,null,"Excellent"]
["CE02",84,null,null,null,null,null,null,"Good"]
["DI01",3,null,null,null,null,null,null,"Fair"]
["DI02",4,null,null,null,null,null,null,"Poor"]
["DI03",5,null,null,null,null,null,null,"None"]
["DI04",6]
["DI05",91]
["EG01",7]
["EG02",8]
["EG03",9]
["EG04",10]
["FE01",11]
["FE02",12]
["FE03",13]
["FE04",14]
["FR01",15]
["FR02",16]
["FR03",17]
["FR04",18]
["GO01",19]
["GO02",20]
["GO03",21]
["GO04",22]
["GR01",23]
["GR02",24]
["GR03",25]
["GR04",26]
["HI01",27]
["HI02",28]
["HI03",29]
["HL01",93]
["HL02",94]
["HL03",95]
["KS01",30]
["KS02",31]
["LH01",34]
["LH02",35]
["LH03",36]
["LH04",37]
["LH05",38]
["LS01",39]
["LS02",40]
["LS03",41]
["LS04",42]
["OG01",43]
["OG02",44]
["OG03",45]
["OG04",46]
["OG06",47]
["OG07",48]
["PP01",49]
["PP02",50]
["PP03",51]
["SC01",56]
["SC02",57]
["SC03",58]
["SC04",59]
["WE00",62]
["WE01",63]
["WE02",64]
["WE03",65]
["WE04",66]
["WG01",87]
["WG02",88]
["WG03",89]
["WG04",90]
["WI01",67]
["WI02",68]
["WI03",69]
["WI04",70]
["WI05",71]
["WI06",72]
["WS01",75]
["WS02",76]
["WS03",77]
["WS04",78]
["WS05",79]
["WS06",80]
["WS07",81]